Reaction Details
TargetEctonucleotide pyrophosphatase/phosphodiesterase family member 1
LigandBDBM50179366
Substrate/Competitorn/a
Meas. Tech.ChEMBL_1583537 (CHEMBL3815624)
Ki 8910±n/a nM
Citation Lee, SYPerotti, ADe Jonghe, SHerdewijn, PHanck, TMüller, CE Thiazolo[3,2-a]benzimidazol-3(2H)-one derivatives: Structure-activity relationships of selective nucleotide pyrophosphatase/phosphodiesterase1 (NPP1) inhibitors. Bioorg Med Chem24:3157-65 (2016) 
 
Ectonucleotide pyrophosphatase/phosphodiesterase family member 1
Name:Ectonucleotide pyrophosphatase/phosphodiesterase family member 1
Type:PROTEIN
Mol. Mass.:104934.43
Organism:Homo sapiens (Human)
Description:ChEMBL_1448940
Residue:925
BDBM50179366
NameBDBM50179366
Synonyms:CHEMBL2391014
TypeSmall organic molecule
Emp. Form.C20H17N3O2S
Mol. Mass.363.433
SMILESO=c1n2c(nc3ccccc23)s\c1=C/c1ccc(cc1)N1CCOCC1