Reaction Details
TargetAlpha-2A adrenergic receptor
LigandBDBM50179382
Substrate/Competitorn/a
Meas. Tech.ChEMBL_1583766 (CHEMBL3815853)
Ki 58000±n/a nM
Citation Vucicevic, JSrdic-Rajic, TPieroni, MLaurila, JMPerovic, VTassini, SAzzali, ECostantino, GGlisic, SAgbaba, DScheinin, MNikolic, KRadi, MVeljkovic, N A combined ligand- and structure-based approach for the identification of rilmenidine-derived compounds which synergize the antitumor effects of doxorubicin. Bioorg Med Chem24:3174-83 (2016) 
 
Alpha-2A adrenergic receptor
Name:Alpha-2A adrenergic receptor
Type:Enzyme
Mol. Mass.:48979.91
Organism:Homo sapiens (Human)
Description:P08913
Residue:465
BDBM50179382
NameBDBM50179382
Synonyms:CHEMBL3814535
TypeSmall organic molecule
Emp. Form.C18H21F3N2O
Mol. Mass.338.3673
SMILESCC(C)Cn1c(C)cc(NCc2ccc(cc2)C(F)(F)F)cc1=O