Reaction Details
TargetAlpha-2A adrenergic receptor
LigandBDBM50179389
Substrate/Competitorn/a
Meas. Tech.ChEMBL_1583766 (CHEMBL3815853)
Ki 110000±n/a nM
Citation Vucicevic, JSrdic-Rajic, TPieroni, MLaurila, JMPerovic, VTassini, SAzzali, ECostantino, GGlisic, SAgbaba, DScheinin, MNikolic, KRadi, MVeljkovic, N A combined ligand- and structure-based approach for the identification of rilmenidine-derived compounds which synergize the antitumor effects of doxorubicin. Bioorg Med Chem24:3174-83 (2016) 
 
Alpha-2A adrenergic receptor
Name:Alpha-2A adrenergic receptor
Type:Enzyme
Mol. Mass.:48979.91
Organism:Homo sapiens (Human)
Description:P08913
Residue:450
BDBM50179389
NameBDBM50179389
Synonyms:CHEMBL3813724
TypeSmall organic molecule
Emp. Form.C18H24N2O
Mol. Mass.284.396
SMILESCCCCCNc1cc(C)n(Cc2ccccc2)c(=O)c1