Reaction Details
TargetAlpha-2A adrenergic receptor
LigandBDBM50179393
Substrate/Competitorn/a
Meas. Tech.ChEMBL_1583766 (CHEMBL3815853)
Ki 4.4±n/a nM
Citation Vucicevic, JSrdic-Rajic, TPieroni, MLaurila, JMPerovic, VTassini, SAzzali, ECostantino, GGlisic, SAgbaba, DScheinin, MNikolic, KRadi, MVeljkovic, N A combined ligand- and structure-based approach for the identification of rilmenidine-derived compounds which synergize the antitumor effects of doxorubicin. Bioorg Med Chem24:3174-83 (2016) 
 
Alpha-2A adrenergic receptor
Name:Alpha-2A adrenergic receptor
Type:Enzyme
Mol. Mass.:48979.91
Organism:Homo sapiens (Human)
Description:P08913
Residue:465
BDBM50179393
NameBDBM50179393
Synonyms:Efaroxan
TypeSmall organic molecule
Emp. Form.C13H16N2O
Mol. Mass.216.2789
SMILESCCC1(Cc2ccccc2O1)C1=NCCN1