Reaction Details
TargetNischarin
LigandBDBM50138499
Substrate/Competitorn/a
Meas. Tech.ChEMBL_1583798 (CHEMBL3815885)
Ki 3715±n/a nM
Citation Vucicevic, JSrdic-Rajic, TPieroni, MLaurila, JMPerovic, VTassini, SAzzali, ECostantino, GGlisic, SAgbaba, DScheinin, MNikolic, KRadi, MVeljkovic, N A combined ligand- and structure-based approach for the identification of rilmenidine-derived compounds which synergize the antitumor effects of doxorubicin. Bioorg Med Chem24:3174-83 (2016) 
 
Nischarin
Name:Nischarin
Type:Enzyme Catalytic Domain
Mol. Mass.:166460.59
Organism:RAT
Description:Q4G017
Residue:1502
BDBM50138499
NameBDBM50138499
Synonyms:2-Phenethyl-4,5-dihydro-1H-imidazole | CHEMBL14210
TypeSmall organic molecule
Emp. Form.C11H14N2
Mol. Mass.174.2423
SMILESC(Cc1ccccc1)C1=NCCN1