Reaction Details
TargetNischarin
LigandBDBM50091345
Substrate/Competitorn/a
Meas. Tech.ChEMBL_1583798 (CHEMBL3815885)
Ki 1.1±n/a nM
Citation Vucicevic, JSrdic-Rajic, TPieroni, MLaurila, JMPerovic, VTassini, SAzzali, ECostantino, GGlisic, SAgbaba, DScheinin, MNikolic, KRadi, MVeljkovic, N A combined ligand- and structure-based approach for the identification of rilmenidine-derived compounds which synergize the antitumor effects of doxorubicin. Bioorg Med Chem24:3174-83 (2016) 
 
Nischarin
Name:Nischarin
Type:Enzyme Catalytic Domain
Mol. Mass.:166460.59
Organism:RAT
Description:Q4G017
Residue:1502
BDBM50091345
NameBDBM50091345
Synonyms:CHEMBL2092861
TypeSmall organic molecule
Emp. Form.C12H16N2
Mol. Mass.188.2688
SMILESC[C@@H](Cc1ccccc1)C1=NCCN1