Reaction Details
TargetOxytocin receptor
LigandBDBM50180159
Substrate/Competitorn/a
Meas. Tech.ChEMBL_1583333 (CHEMBL3816396)
EC50 175±n/a nM
Citation Sciabola, SGoetz, GHBai, GRogers, BNGray, DLDuplantier, AFonseca, KRVanase-Frawley, MAKablaoui, NM Systematic N-methylation of oxytocin: Impact on pharmacology and intramolecular hydrogen bonding network. Bioorg Med Chem24:3513-20 (2016) 
 
Oxytocin receptor
Name:Oxytocin receptor
Type:Enzyme Catalytic Domain
Mol. Mass.:42793.26
Organism:Homo sapiens (Human)
Description:Oxytocin OXTR HEK293::B2R9L7
Residue:389
BDBM50180159
NameBDBM50180159
Synonyms:CHEMBL3814232
TypeSmall organic molecule
Emp. Form.C45H70N12O12S2
Mol. Mass.1035.24
SMILES[H][C@]1(NC(=O)[C@H](Cc2ccc(O)cc2)NC(=O)[C@H](CSSC[C@H](N(C)C(=O)[C@H](CC(N)=O)NC(=O)[C@H](CCC(N)=O)NC1=O)C(=O)N1CCC[C@H]1C(=O)N[C@@H](CC(C)C)C(=O)NCC(N)=O)NC)[C@@H](C)CC