Reaction Details
TargetOxytocin receptor
LigandBDBM50180132
Substrate/Competitorn/a
Meas. Tech.ChEMBL_1583333 (CHEMBL3816396)
EC50 0.470000±n/a nM
Citation Sciabola, SGoetz, GHBai, GRogers, BNGray, DLDuplantier, AFonseca, KRVanase-Frawley, MAKablaoui, NM Systematic N-methylation of oxytocin: Impact on pharmacology and intramolecular hydrogen bonding network. Bioorg Med Chem24:3513-20 (2016) 
 
Oxytocin receptor
Name:Oxytocin receptor
Type:Enzyme Catalytic Domain
Mol. Mass.:42793.26
Organism:Homo sapiens (Human)
Description:Oxytocin OXTR HEK293::B2R9L7
Residue:389
BDBM50180132
NameBDBM50180132
Synonyms:CHEMBL3814633
TypeSmall organic molecule
Emp. Form.C44H68N12O12S2
Mol. Mass.1021.214
SMILES[H][C@]1(NC(=O)[C@H](Cc2ccc(O)cc2)NC(=O)[C@@H](N)CSSC[C@H](NC(=O)[C@H](CC(N)=O)NC(=O)[C@H](CCC(N)=O)NC1=O)C(=O)N1CCC[C@H]1C(=O)N[C@@H](CC(C)C)C(=O)N(C)CC(N)=O)[C@@H](C)CC