Reaction Details
TargetDual 3',5'-cyclic-AMP and -GMP phosphodiesterase 11A
LigandBDBM50180268
Substrate/Competitorn/a
Meas. Tech.ChEMBL_1583590 (CHEMBL3815677)
IC50>10000±n/a nM
Citation Yoshikawa, MHitaka, THasui, TFushimi, MKunitomo, JKokubo, HOki, HNakashima, KTaniguchi, T Design and synthesis of potent and selective pyridazin-4(1H)-one-based PDE10A inhibitors interacting with Tyr683 in the PDE10A selectivity pocket. Bioorg Med Chem24:3447-55 (2016) 
 
Dual 3',5'-cyclic-AMP and -GMP phosphodiesterase 11A
Name:Dual 3',5'-cyclic-AMP and -GMP phosphodiesterase 11A
Type:Enzyme
Mol. Mass.:104751.53
Organism:Homo sapiens (Human)
Description:Q9HCR9
Residue:933
BDBM50180268
NameBDBM50180268
Synonyms:CHEMBL3814662
TypeSmall organic molecule
Emp. Form.C28H27N7O2
Mol. Mass.493.5597
SMILESO=c1c(OCCN2CCn3c2nc2ccccc32)cn(CC2CC2)nc1-c1ccnn1-c1ccccc1