Reaction Details
TargetcAMP and cAMP-inhibited cGMP 3',5'-cyclic phosphodiesterase 10A
LigandBDBM50180271
Substrate/Competitorn/a
Meas. Tech.ChEMBL_1583580 (CHEMBL3815667)
IC50 0.810000±n/a nM
Citation Yoshikawa, MHitaka, THasui, TFushimi, MKunitomo, JKokubo, HOki, HNakashima, KTaniguchi, T Design and synthesis of potent and selective pyridazin-4(1H)-one-based PDE10A inhibitors interacting with Tyr683 in the PDE10A selectivity pocket. Bioorg Med Chem24:3447-55 (2016) 
 
cAMP and cAMP-inhibited cGMP 3',5'-cyclic phosphodiesterase 10A
Name:cAMP and cAMP-inhibited cGMP 3',5'-cyclic phosphodiesterase 10A
Type:Protein
Mol. Mass.:88412.52
Organism:Homo sapiens (Human)
Description:Q9Y233
Residue:779
BDBM50180271
NameBDBM50180271
Synonyms:CHEMBL3814601
TypeSmall organic molecule
Emp. Form.C28H28N6O2
Mol. Mass.480.5609
SMILESCn1c(CCCOc2cn(CC3CC3)nc(-c3ccnn3-c3ccccc3)c2=O)nc2ccccc12