Reaction Details
TargetCarbonic anhydrase 1
LigandBDBM50433839
Substrate/Competitorn/a
Meas. Tech.ChEMBL_1583613 (CHEMBL3815700)
Ki 32±n/a nM
Citation Vullo, DSupuran, CTScozzafava, ADe Simone, GMonti, SMAlterio, VCarta, F Kinetic and X-ray crystallographic investigations of substituted 2-thio-6-oxo-1,6-dihydropyrimidine-benzenesulfonamides acting as carbonic anhydrase inhibitors. Bioorg Med Chem24:3643-8 (2016) 
 
Carbonic anhydrase 1
Name:Carbonic anhydrase 1
Type:Enzyme
Mol. Mass.:28873.37
Organism:Homo sapiens (Human)
Description:P00915
Residue:261
BDBM50433839
NameBDBM50433839
Synonyms:CHEMBL2382405
TypeSmall organic molecule
Emp. Form.C22H21N5O5S2
Mol. Mass.499.563
SMILESCCC(Sc1nc(-c2cccc(OC)c2)c(C#N)c(=O)[nH]1)C(=O)Nc1ccc(cc1)S(N)(=O)=O