Reaction Details
TargetCarbonic anhydrase 9
LigandBDBM50433839
Substrate/Competitorn/a
Meas. Tech.ChEMBL_1583615 (CHEMBL3815702)
Ki 24±n/a nM
Citation Vullo, DSupuran, CTScozzafava, ADe Simone, GMonti, SMAlterio, VCarta, F Kinetic and X-ray crystallographic investigations of substituted 2-thio-6-oxo-1,6-dihydropyrimidine-benzenesulfonamides acting as carbonic anhydrase inhibitors. Bioorg Med Chem24:3643-8 (2016) 
 
Carbonic anhydrase 9
Name:Carbonic anhydrase 9
Type:Enzyme
Mol. Mass.:49669.03
Organism:Homo sapiens (Human)
Description:Catalytic domain of human cloned isozyme was used in the assay
Residue:459
BDBM50433839
NameBDBM50433839
Synonyms:CHEMBL2382405
TypeSmall organic molecule
Emp. Form.C22H21N5O5S2
Mol. Mass.499.563
SMILESCCC(Sc1nc(-c2cccc(OC)c2)c(C#N)c(=O)[nH]1)C(=O)Nc1ccc(cc1)S(N)(=O)=O