Reaction Details
TargetMaltase-glucoamylase
LigandBDBM50180580
Substrate/Competitorn/a
Meas. Tech.ChEMBL_1583833 (CHEMBL3815265)
IC50 640±n/a nM
Citation Tanabe, GXie, WBalakishan, GAmer, MFTsutsui, NTakemura, HNakamura, SAkaki, JNinomiya, KMorikawa, TNakanishi, IMuraoka, O Hydrophobic substituents increase the potency of salacinol, a potenta-glucosidase inhibitor from Ayurvedic traditional medicine 'Salacia'. Bioorg Med Chem24:3705-15 (2016) 
 
Maltase-glucoamylase
Name:Maltase-glucoamylase
Type:Enzyme
Mol. Mass.:209817.06
Organism:Homo sapiens (Human)
Description:O43451
Residue:1857
BDBM50180580
NameBDBM50180580
Synonyms:CHEMBL3814911
TypeSmall organic molecule
Emp. Form.C16H33ClO6S
Mol. Mass.388.948
SMILES[Cl-].CCCCCCCO[C@@H](CO)[C@H](O)C[S+]1C[C@@H](O)[C@H](O)[C@H]1CO