Reaction Details
TargetSucrase-isomaltase, intestinal
LigandBDBM50180520
Substrate/Competitorn/a
Meas. Tech.ChEMBL_1583831 (CHEMBL3815263)
IC50 120±n/a nM
Citation Tanabe, GXie, WBalakishan, GAmer, MFTsutsui, NTakemura, HNakamura, SAkaki, JNinomiya, KMorikawa, TNakanishi, IMuraoka, O Hydrophobic substituents increase the potency of salacinol, a potenta-glucosidase inhibitor from Ayurvedic traditional medicine 'Salacia'. Bioorg Med Chem24:3705-15 (2016) 
 
Sucrase-isomaltase, intestinal
Name:Sucrase-isomaltase, intestinal
Type:Enzyme
Mol. Mass.:210329.04
Organism:Rattus norvegicus (Rat)
Description:P23739
Residue:1841
BDBM50180520
NameBDBM50180520
Synonyms:CHEMBL3814838
TypeSmall organic molecule
Emp. Form.C11H23ClO6S
Mol. Mass.318.815
SMILES[Cl-].CCO[C@@H](CO)[C@H](O)C[S+]1C[C@@H](O)[C@H](O)[C@H]1CO