Reaction Details
TargetPotassium channel subfamily K member 2
LigandBDBM17636
Substrate/Competitorn/a
Meas. Tech.ChEMBL_1584382 (CHEMBL3819803)
EC50 100000±n/a nM
Citation Vivier, DBennis, KLesage, FDucki, S Perspectives on the Two-Pore Domain Potassium Channel TREK-1 (TWIK-Related K(+) Channel 1). A Novel Therapeutic Target? J Med Chem59:5149-57 (2016) 
 
Potassium channel subfamily K member 2
Name:Potassium channel subfamily K member 2
Type:Protein
Mol. Mass.:47099.16
Organism:Homo sapiens (Human)
Description:O95069
Residue:426
BDBM17636
NameBDBM17636
Synonyms:2-{[3-(trifluoromethyl)phenyl]amino}benzoic acid CHEMBL23588 Nichisedan US9271961, Flufenamic Acid
TypeSmall organic molecule
Emp. Form.C14H10F3NO2
Mol. Mass.281.2299
SMILESOC(=O)c1ccccc1Nc1cccc(c1)C(F)(F)F