Reaction Details
TargetPotassium channel subfamily K member 2
LigandBDBM50180661
Substrate/Competitorn/a
Meas. Tech.ChEMBL_1584408 (CHEMBL3819951)
IC50 9000±n/a nM
Citation Vivier, DBennis, KLesage, FDucki, S Perspectives on the Two-Pore Domain Potassium Channel TREK-1 (TWIK-Related K(+) Channel 1). A Novel Therapeutic Target? J Med Chem59:5149-57 (2016) 
 
Potassium channel subfamily K member 2
Name:Potassium channel subfamily K member 2
Type:Protein
Mol. Mass.:47099.16
Organism:Homo sapiens (Human)
Description:O95069
Residue:426
BDBM50180661
NameBDBM50180661
Synonyms:Norfluoxetine
TypeSmall organic molecule
Emp. Form.C16H16F3NO
Mol. Mass.295.2995
SMILESNCCC(Oc1ccc(cc1)C(F)(F)F)c1ccccc1