Reaction Details
TargetPotassium channel subfamily K member 2
LigandBDBM79172
Substrate/Competitorn/a
Meas. Tech.ChEMBL_1584411 (CHEMBL3819954)
IC50 2000±n/a nM
Citation Vivier, DBennis, KLesage, FDucki, S Perspectives on the Two-Pore Domain Potassium Channel TREK-1 (TWIK-Related K(+) Channel 1). A Novel Therapeutic Target? J Med Chem59:5149-57 (2016) 
 
Potassium channel subfamily K member 2
Name:Potassium channel subfamily K member 2
Type:Protein
Mol. Mass.:47099.16
Organism:Homo sapiens (Human)
Description:O95069
Residue:426
BDBM79172
NameBDBM79172
Synonyms:2-[4-[(3Z)-3-[2-(trifluoromethyl)-9-thioxanthenylidene]propyl]-1-piperazinyl]ethanol;hydrochloride 2-[4-[(3Z)-3-[2-(trifluoromethyl)thioxanthen-9-ylidene]propyl]piperazino]ethanol;hydrochloride MLS001332581 cid_10140115 | cis-(Z)-Flupenthixol dihydrochloride
TypeSmall organic molecule
Emp. Form.C23H25F3N2OS
Mol. Mass.434.518
SMILESOCCN1CCN(CC\C=C2\c3ccccc3Sc3ccc(cc23)C(F)(F)F)CC1