Reaction Details
TargetPotassium two pore domain channel subfamily K member 2
LigandBDBM50180663
Substrate/Competitorn/a
Meas. Tech.ChEMBL_1584412 (CHEMBL3819955)
IC50 750±n/a nM
Citation Vivier, DBennis, KLesage, FDucki, S Perspectives on the Two-Pore Domain Potassium Channel TREK-1 (TWIK-Related K(+) Channel 1). A Novel Therapeutic Target? J Med Chem59:5149-57 (2016) 
 
Potassium two pore domain channel subfamily K member 2
Name:Potassium two pore domain channel subfamily K member 2
Synonyms:Potassium channel subfamily K member 2
Type:PROTEIN
Mol. Mass.:45443.30
Organism:Bos taurus
Description:ChEMBL_620769
Residue:411
BDBM50180663
NameBDBM50180663
TypeSmall organic molecule
Emp. Form.C36H39N3O6
Mol. Mass.609.7114
SMILESCOC(=O)C1=C(C)NC(C)=C(C1c1cccc(c1)[N+]([O-])=O)C(=O)OCCCN1CCC(CC1)(c1ccccc1)c1ccccc1