Reaction Details
TargetPotassium channel subfamily K member 2
LigandBDBM50067133
Substrate/Competitorn/a
Meas. Tech.ChEMBL_1584413 (CHEMBL3819956)
IC50 7600±n/a nM
Citation Vivier, DBennis, KLesage, FDucki, S Perspectives on the Two-Pore Domain Potassium Channel TREK-1 (TWIK-Related K(+) Channel 1). A Novel Therapeutic Target? J Med Chem59:5149-57 (2016) 
 
Potassium channel subfamily K member 2
Name:Potassium channel subfamily K member 2
Type:Protein
Mol. Mass.:47099.16
Organism:Homo sapiens (Human)
Description:O95069
Residue:426
BDBM50067133
NameBDBM50067133
Synonyms:1-(2-(2-hydroxy-3-(propylamino)propoxy)phenyl)-3-phenylpropan-1-one 1-[2-(2-Hydroxy-3-propylamino-propoxy)-phenyl]-3-phenyl-propan-1-one (propafenone) CHEMBL631 PROPAFENONE | Rythmol
TypeSmall organic molecule
Emp. Form.C21H27NO3
Mol. Mass.341.444
SMILESCCCNCC(O)COc1ccccc1C(=O)CCc1ccccc1