Reaction Details
TargetProlyl endopeptidase
LigandBDBM50051495
Substrate/Competitorn/a
Meas. Tech.ChEMBL_1584425 (CHEMBL3819968)
Ki 0.060000±n/a nM
Citation Mariaule, GDe Cesco, SAiraghi, FKurian, JSchiavini, PRocheleau, SHuskic, IAuclair, KMittermaier, AMoitessier, N 3-Oxo-hexahydro-1H-isoindole-4-carboxylic Acid as a Drug Chiral Bicyclic Scaffold: Structure-Based Design and Preparation of Conformationally Constrained Covalent and Noncovalent Prolyl Oligopeptidase Inhibitors. J Med Chem59:4221-34 (2016) 
 
Prolyl endopeptidase
Name:Prolyl endopeptidase
Type:n/a
Mol. Mass.:80758.04
Organism:Sus scrofa
Description:n/a
Residue:710
BDBM50051495
NameBDBM50051495
Synonyms:(S)-2-[(S)-2-(2-Hydroxy-acetyl)-pyrrolidine-1-carbonyl]-pyrrolidine-1-carboxylic acid benzylamide CHEMBL76578
TypeSmall organic molecule
Emp. Form.C19H25N3O4
Mol. Mass.359.4195
SMILESOCC(=O)[C@@H]1CCCN1C(=O)[C@@H]1CCCN1C(=O)NCc1ccccc1