Reaction Details
TargetCarbonic anhydrase 2
LigandBDBM50423787
Substrate/Competitorn/a
Meas. Tech.ChEMBL_1584562 (CHEMBL3820553)
Kd 60600±n/a nM
Citation Gaspari, RRechlin, CHeine, ABottegoni, GRocchia, WSchwarz, DBomke, JGerber, HDKlebe, GCavalli, A Kinetic and Structural Insights into the Mechanism of Binding of Sulfonamides to Human Carbonic Anhydrase by Computational and Experimental Studies. J Med Chem59:4245-56 (2016) 
 
Carbonic anhydrase 2
Name:Carbonic anhydrase 2
Type:Enzyme
Mol. Mass.:29250.71
Organism:Homo sapiens (Human)
Description:P00918
Residue:260
BDBM50423787
NameBDBM50423787
Synonyms:4-Propyl-Benzenesulfonamide CHEMBL148660
TypeSmall organic molecule
Emp. Form.C9H13NO2S
Mol. Mass.199.27
SMILESCCCc1ccc(cc1)S(N)(=O)=O