Reaction Details
TargetAndrogen receptor
LigandBDBM50180695
Substrate/Competitorn/a
Meas. Tech.ChEMBL_1584566 (CHEMBL3820557)
EC50 0.251189±n/a nM
Citation Handlon, ALSchaller, LTLeesnitzer, LMMerrihew, RVPoole, CUlrich, JCWilson, JWCadilla, RTurnbull, P Optimizing Ligand Efficiency of Selective Androgen Receptor Modulators (SARMs). ACS Med Chem Lett7:83-8 (2016) 
 
Androgen receptor
Name:Androgen receptor
Type:Receptor
Mol. Mass.:99185.27
Organism:Homo sapiens (Human)
Description:CHO cells were stably transfected with human AR gene.
Residue:920
BDBM50180695
NameBDBM50180695
Synonyms:CHEMBL3819080
TypeSmall organic molecule
Emp. Form.C15H9F6NO2
Mol. Mass.349.2279
SMILESCc1c(ccc(C#N)c1C(F)(F)F)C(O)(c1ccco1)C(F)(F)F