Reaction Details
TargetAndrogen receptor
LigandBDBM50180802
Substrate/Competitorn/a
Meas. Tech.ChEMBL_1584566 (CHEMBL3820557)
EC50 20±n/a nM
Citation Handlon, ALSchaller, LTLeesnitzer, LMMerrihew, RVPoole, CUlrich, JCWilson, JWCadilla, RTurnbull, P Optimizing Ligand Efficiency of Selective Androgen Receptor Modulators (SARMs). ACS Med Chem Lett7:83-8 (2016) 
 
Androgen receptor
Name:Androgen receptor
Type:Receptor
Mol. Mass.:99185.27
Organism:Homo sapiens (Human)
Description:CHO cells were stably transfected with human AR gene.
Residue:920
BDBM50180802
NameBDBM50180802
Synonyms:CHEMBL3819002
TypeSmall organic molecule
Emp. Form.C11H6ClF6NO
Mol. Mass.317.615
SMILESCc1c(Cl)c(ccc1C(O)(C(F)(F)F)C(F)(F)F)C#N