Reaction Details
TargetAndrogen receptor
LigandBDBM50180812
Substrate/Competitorn/a
Meas. Tech.ChEMBL_1584566 (CHEMBL3820557)
EC50 0.398107±n/a nM
Citation Handlon, ALSchaller, LTLeesnitzer, LMMerrihew, RVPoole, CUlrich, JCWilson, JWCadilla, RTurnbull, P Optimizing Ligand Efficiency of Selective Androgen Receptor Modulators (SARMs). ACS Med Chem Lett7:83-8 (2016) 
 
Androgen receptor
Name:Androgen receptor
Type:Receptor
Mol. Mass.:99185.27
Organism:Homo sapiens (Human)
Description:CHO cells were stably transfected with human AR gene.
Residue:920
BDBM50180812
NameBDBM50180812
Synonyms:CHEMBL3818577
TypeSmall organic molecule
Emp. Form.C12H9ClF3NO
Mol. Mass.275.654
SMILESOC(C1CC1)(c1ccc(C#N)c(Cl)c1)C(F)(F)F