Reaction Details
TargetAndrogen receptor
LigandBDBM50180817
Substrate/Competitorn/a
Meas. Tech.ChEMBL_1584566 (CHEMBL3820557)
EC50 13±n/a nM
Citation Handlon, ALSchaller, LTLeesnitzer, LMMerrihew, RVPoole, CUlrich, JCWilson, JWCadilla, RTurnbull, P Optimizing Ligand Efficiency of Selective Androgen Receptor Modulators (SARMs). ACS Med Chem Lett7:83-8 (2016) 
 
Androgen receptor
Name:Androgen receptor
Type:Receptor
Mol. Mass.:99185.27
Organism:Homo sapiens (Human)
Description:CHO cells were stably transfected with human AR gene.
Residue:920
BDBM50180817
NameBDBM50180817
Synonyms:CHEMBL3819417
TypeSmall organic molecule
Emp. Form.C14H16F3NO
Mol. Mass.271.2781
SMILESCC(C)C(O)(c1ccc(C#N)c(C)c1C)C(F)(F)F