Reaction Details
TargetAndrogen receptor
LigandBDBM50180818
Substrate/Competitorn/a
Meas. Tech.ChEMBL_1584566 (CHEMBL3820557)
EC50 2512±n/a nM
Citation Handlon, ALSchaller, LTLeesnitzer, LMMerrihew, RVPoole, CUlrich, JCWilson, JWCadilla, RTurnbull, P Optimizing Ligand Efficiency of Selective Androgen Receptor Modulators (SARMs). ACS Med Chem Lett7:83-8 (2016) 
 
Androgen receptor
Name:Androgen receptor
Type:Receptor
Mol. Mass.:99185.27
Organism:Homo sapiens (Human)
Description:CHO cells were stably transfected with human AR gene.
Residue:920
BDBM50180818
NameBDBM50180818
Synonyms:CHEMBL3818033
TypeSmall organic molecule
Emp. Form.C12H12F3NO
Mol. Mass.243.225
SMILESCc1c(C)c(ccc1C#N)C(C)(O)C(F)(F)F