Reaction Details
TargetDual specificity mitogen-activated protein kinase kinase 1
LigandBDBM50180836
Substrate/Competitorn/a
Meas. Tech.ChEMBL_1584574 (CHEMBL3820565)
IC50 0.019000±n/a nM
Citation Van Dort, MEHong, HWang, HNino, CALombardi, RLBlanks, AEGalbán, SRoss, BD Discovery of Bifunctional Oncogenic Target Inhibitors against Allosteric Mitogen-Activated Protein Kinase (MEK1) and Phosphatidylinositol 3-Kinase (PI3K). J Med Chem59:2512-22 (2016) 
 
Dual specificity mitogen-activated protein kinase kinase 1
Name:Dual specificity mitogen-activated protein kinase kinase 1
Type:Other Protein Type
Mol. Mass.:43439.03
Organism:Homo sapiens (Human)
Description:Full-length human MEK-1 was generated by PCR and purified as a fusion protein from Escherichia coli lysates.
Residue:393
BDBM50180836
NameBDBM50180836
Synonyms:CHEMBL3818677
TypeSmall organic molecule
Emp. Form.C40H43F5IN11O4
Mol. Mass.963.7372
SMILESFC(F)c1nc2ccccc2n1-c1nc(nc(n1)N1CCN(CC1)C(=O)CCCCCNCCONC(=O)c1ccc(F)c(F)c1Nc1ccc(I)cc1F)N1CCOCC1