Reaction Details
TargetPantothenate synthetase
LigandBDBM50180855
Substrate/Competitorn/a
Meas. Tech.ChEMBL_1584956 (CHEMBL3819980)
IC50 250±n/a nM
Citation Radoux, CJOlsson, TSPitt, WRGroom, CRBlundell, TL Identifying Interactions that Determine Fragment Binding at Protein Hotspots. J Med Chem59:4314-25 (2016) 
 
Pantothenate synthetase
Name:Pantothenate synthetase
Type:n/a
Mol. Mass.:32675.10
Organism:Mycobacterium tuberculosis (strain ATCC 25618 / H37Rv)
Description:ChEMBL_102878
Residue:309
BDBM50180855
NameBDBM50180855
Synonyms:CHEMBL3818314
TypeSmall organic molecule
Emp. Form.C20H17F3N2O6S
Mol. Mass.470.419
SMILESCOc1ccc2n(CC(O)=O)c(cc2c1)C(=O)NS(=O)(=O)Cc1ccc(cc1)C(F)(F)F