Reaction Details
TargetAcetylcholinesterase
LigandBDBM26474
Substrate/Competitorn/a
Meas. Tech.ChEMBL_1584962 (CHEMBL3819986)
IC50 930±n/a nM
Citation Ehrt, CBrinkjost, TKoch, O Impact of Binding Site Comparisons on Medicinal Chemistry and Rational Molecular Design. J Med Chem59:4121-51 (2016) 
 
Acetylcholinesterase
Name:Acetylcholinesterase
Type:Enzyme
Mol. Mass.:67792.70
Organism:Homo sapiens (Human)
Description:P22303
Residue:614
BDBM26474
NameBDBM26474
Synonyms:5-({4-[(2,3-dimethyl-2H-indazol-6-yl)(methyl)amino]pyrimidin-2-yl}amino)-2-methylbenzene-1-sulfonamide JMC514632 Compound 13 cid_10113978
TypeSmall organic molecule
Emp. Form.C21H23N7O2S
Mol. Mass.437.518
SMILESCN(c1ccc2c(C)n(C)nc2c1)c1ccnc(Nc2ccc(C)c(c2)S(N)(=O)=O)n1