Reaction Details
TargetE3 ubiquitin-protein ligase Mdm2
LigandBDBM31197
Substrate/Competitorn/a
Meas. Tech.ChEMBL_1585034 (CHEMBL3820275)
IC50 105±n/a nM
Citation Daniele, SLa Pietra, VBarresi, EDi Maro, SDa Pozzo, ERobello, MLa Motta, CCosconati, STaliani, SMarinelli, LNovellino, EMartini, CDa Settimo, F Lead Optimization of 2-Phenylindolylglyoxylyldipeptide Murine Double Minute (MDM)2/Translocator Protein (TSPO) Dual Inhibitors for the Treatment of Gliomas. J Med Chem59:4526-38 (2016) 
 
E3 ubiquitin-protein ligase Mdm2
Name:E3 ubiquitin-protein ligase Mdm2
Type:Oncoprotein
Mol. Mass.:55196.54
Organism:Homo sapiens (Human)
Description:Q00987
Residue:491
BDBM31197
NameBDBM31197
Synonyms:CHEMBL211045 med.21724, Compound 186
TypeSmall organic molecule
Emp. Form.C30H30Cl2N4O4
Mol. Mass.581.49
SMILESCOc1ccc(C2=NC(C(N2C(=O)N2CCNC(=O)C2)c2ccc(Cl)cc2)c2ccc(Cl)cc2)c(OC(C)C)c1