Reaction Details
TargetN-lysine methyltransferase SMYD2
LigandBDBM50180967
Substrate/Competitorn/a
Meas. Tech.ChEBML_1585280
IC50 19±n/a nM
Citation Eggert, EHillig, RCKoehr, SStöckigt, DWeiske, JBarak, NMowat, JBrumby, TChrist, CDTer Laak, ALang, TFernandez-Montalvan, AEBadock, VWeinmann, HHartung, IVBarsyte-Lovejoy, DSzewczyk, MKennedy, SLi, FVedadi, MBrown, PJSanthakumar, VArrowsmith, CHStellfeld, TStresemann, C Discovery and Characterization of a Highly Potent and Selective Aminopyrazoline-Based in Vivo Probe (BAY-598) for the Protein Lysine Methyltransferase SMYD2. J Med Chem59:4578-600 (2016) 
 
N-lysine methyltransferase SMYD2
Name:N-lysine methyltransferase SMYD2
Type:Enzyme
Mol. Mass.:49689.57
Organism:Homo sapiens (Human)
Description:Q9NRG4
Residue:433
BDBM50180967
NameBDBM50180967
Synonyms:CHEMBL3818487
TypeSmall organic molecule
Emp. Form.C22H19Cl2F3N6O3
Mol. Mass.543.326
SMILESCCN([C@H]1CN(N=C1c1ccc(Cl)c(Cl)c1)C(\Nc1cc(F)cc(OC(F)F)c1)=N/C#N)C(=O)CO