Reaction Details
TargetN-lysine methyltransferase SMYD2
LigandBDBM50180972
Substrate/Competitorn/a
Meas. Tech.ChEBML_1585280
IC50 4200±n/a nM
Citation Eggert, EHillig, RCKoehr, SStöckigt, DWeiske, JBarak, NMowat, JBrumby, TChrist, CDTer Laak, ALang, TFernandez-Montalvan, AEBadock, VWeinmann, HHartung, IVBarsyte-Lovejoy, DSzewczyk, MKennedy, SLi, FVedadi, MBrown, PJSanthakumar, VArrowsmith, CHStellfeld, TStresemann, C Discovery and Characterization of a Highly Potent and Selective Aminopyrazoline-Based in Vivo Probe (BAY-598) for the Protein Lysine Methyltransferase SMYD2. J Med Chem59:4578-600 (2016) 
 
N-lysine methyltransferase SMYD2
Name:N-lysine methyltransferase SMYD2
Type:Enzyme
Mol. Mass.:49689.57
Organism:Homo sapiens (Human)
Description:Q9NRG4
Residue:433
BDBM50180972
NameBDBM50180972
Synonyms:CHEMBL3817978
TypeSmall organic molecule
Emp. Form.C23H22F2N6O5
Mol. Mass.500.4548
SMILESCCN(C1CN(N=C1c1ccc2OCOc2c1)C(\Nc1cccc(OC(F)F)c1)=N/C#N)C(=O)CO