Reaction Details
TargetProteinase-activated receptor 1
LigandBDBM50181502
Substrate/Competitorn/a
Meas. Tech.ChEMBL_1585283 (CHEMBL3821546)
IC50 30±n/a nM
Citation Eggert, EHillig, RCKoehr, SStöckigt, DWeiske, JBarak, NMowat, JBrumby, TChrist, CDTer Laak, ALang, TFernandez-Montalvan, AEBadock, VWeinmann, HHartung, IVBarsyte-Lovejoy, DSzewczyk, MKennedy, SLi, FVedadi, MBrown, PJSanthakumar, VArrowsmith, CHStellfeld, TStresemann, C Discovery and Characterization of a Highly Potent and Selective Aminopyrazoline-Based in Vivo Probe (BAY-598) for the Protein Lysine Methyltransferase SMYD2. J Med Chem59:4578-600 (2016) 
 
Proteinase-activated receptor 1
Name:Proteinase-activated receptor 1
Type:Protein
Mol. Mass.:47450.07
Organism:Homo sapiens (Human)
Description:P25116
Residue:425
BDBM50181502
NameBDBM50181502
Synonyms:CHEMBL3818510
TypeSmall organic molecule
Emp. Form.C22H21Cl3N6O2
Mol. Mass.507.8
SMILESCCN(C1CN(N=C1c1ccc(Cl)cc1)C(\Nc1ccc(Cl)c(Cl)c1)=N/C#N)C(=O)COC