Reaction Details
TargetN-lysine methyltransferase SMYD2
LigandBDBM50075102
Substrate/Competitorn/a
Meas. Tech.ChEMBL_1585278 (CHEMBL3821409)
IC50<15±n/a nM
Citation Eggert, EHillig, RCKoehr, SStöckigt, DWeiske, JBarak, NMowat, JBrumby, TChrist, CDTer Laak, ALang, TFernandez-Montalvan, AEBadock, VWeinmann, HHartung, IVBarsyte-Lovejoy, DSzewczyk, MKennedy, SLi, FVedadi, MBrown, PJSanthakumar, VArrowsmith, CHStellfeld, TStresemann, C Discovery and Characterization of a Highly Potent and Selective Aminopyrazoline-Based in Vivo Probe (BAY-598) for the Protein Lysine Methyltransferase SMYD2. J Med Chem59:4578-600 (2016) 
 
N-lysine methyltransferase SMYD2
Name:N-lysine methyltransferase SMYD2
Type:Enzyme
Mol. Mass.:49689.57
Organism:Homo sapiens (Human)
Description:Q9NRG4
Residue:433
BDBM50075102
NameBDBM50075102
Synonyms:CHEMBL3414623
TypeSmall organic molecule
Emp. Form.C36H42N6O
Mol. Mass.574.7583
SMILESCc1cn(CCN2CCN(CC2)c2ccccc2-c2cc(cc(c2)C(=O)NCCCN2CCCC2)C#N)c2ccccc12