Reaction Details
TargetN-lysine methyltransferase SMYD2
LigandBDBM50181503
Substrate/Competitorn/a
Meas. Tech.ChEMBL_1585277 (CHEMBL3821408)
IC50 2200±n/a nM
Citation Eggert, EHillig, RCKoehr, SStöckigt, DWeiske, JBarak, NMowat, JBrumby, TChrist, CDTer Laak, ALang, TFernandez-Montalvan, AEBadock, VWeinmann, HHartung, IVBarsyte-Lovejoy, DSzewczyk, MKennedy, SLi, FVedadi, MBrown, PJSanthakumar, VArrowsmith, CHStellfeld, TStresemann, C Discovery and Characterization of a Highly Potent and Selective Aminopyrazoline-Based in Vivo Probe (BAY-598) for the Protein Lysine Methyltransferase SMYD2. J Med Chem59:4578-600 (2016) 
 
N-lysine methyltransferase SMYD2
Name:N-lysine methyltransferase SMYD2
Type:Enzyme
Mol. Mass.:49689.57
Organism:Homo sapiens (Human)
Description:Q9NRG4
Residue:433
BDBM50181503
NameBDBM50181503
Synonyms:CHEMBL3819513
TypeSmall organic molecule
Emp. Form.C23H23ClF2N6O3
Mol. Mass.504.917
SMILESCCCN(C1CN(N=C1c1ccc(Cl)cc1)C(\Nc1cccc(OC(F)F)c1)=N/C#N)C(=O)CO