Reaction Details
TargetSigma non-opioid intracellular receptor 1
LigandBDBM50181054
Substrate/Competitorn/a
Meas. Tech.ChEMBL_1584462 (CHEMBL3820109)
Ki 1.6±n/a nM
Citation Weber, FBrune, SBörgel, FLange, CKorpis, KBednarski, PJLaurini, EFermeglia, MPricl, SSchepmann, DWünsch, B Rigidity versus Flexibility: Is This an Issue ins1 Receptor Ligand Affinity and Activity? J Med Chem59:5505-19 (2016) 
 
Sigma non-opioid intracellular receptor 1
Name:Sigma non-opioid intracellular receptor 1
Type:Protein
Mol. Mass.:25307.17
Organism:Cavia porcellus (Guinea pig)
Description:Q60492
Residue:223
BDBM50181054
NameBDBM50181054
Synonyms:CHEMBL3819146
TypeSmall organic molecule
Emp. Form.C21H32N2O
Mol. Mass.328.4916
SMILES[H][C@]12CN(CC3CCCCC3)[C@]([H])(CN1Cc1ccccc1)[C@H](O)CC2