Reaction Details
TargetNeuraminidase
LigandBDBM50330326
Substrate/Competitorn/a
Meas. Tech.ChEMBL_1584609 (CHEMBL3820937)
IC50 1.9±n/a nM
Citation Wang, PCFang, JMTsai, KCWang, SYHuang, WITseng, YCCheng, YSCheng, TJWong, CH Peramivir Phosphonate Derivatives as Influenza Neuraminidase Inhibitors. J Med Chem59:5297-310 (2016) 
 
Neuraminidase
Name:Neuraminidase
Type:PROTEIN
Mol. Mass.:49687.56
Organism:Influenza A virus
Description:ChEMBL_1347422
Residue:453
BDBM50330326
NameBDBM50330326
Synonyms:(4S,5R,6R)-5-Acetylamino-4-guanidino-6-((1R,3R)-1,2,3-trihydroxy-propyl)-5,6-dihydro-4H-pyran-2-carboxylic acid (4S,5R,6R)-5-Acetylamino-4-guanidino-6-(1,2,3-trihydroxy-propyl)-5,6-dihydro-4H-pyran-2-carboxylic acid (4S,5R,6R)-5-acetylamino-4-guanidino-6-((1R,2R)-1,2,3-trihydroxy-propy)-5,6-dihydro-4H-pyran-2-carboxylic acid 4-diaminomethylamino-3-methylcarboxamido-2-(1,2,3-trihydroxypropyl)-(3R)-3,4-dihydro-2H-6-pyrancarboxylic acid(Zanamivir) 5-Acetylamino-4-guanidino-6-(1,2,3-trihydroxy-propyl)-5,6-dihydro-4H-pyran-2-carboxylic acid(zanamivir) CHEMBL222813 Relenza | Zanamivi
TypeSmall organic molecule
Emp. Form.C12H20N4O7
Mol. Mass.332.3098
SMILES[#6]-[#6](=O)-[#7]-[#6@@H]-1-[#6@H](-[#6]=[#6](-[#8]-[#6@H]-1-[#6@H](-[#8])-[#6@H](-[#8])-[#6]-[#8])-[#6](-[#8])=O)\[#7]=[#6](\[#7])-[#7]