Reaction Details
TargetNeuraminidase
LigandBDBM4994
Substrate/Competitorn/a
Meas. Tech.ChEMBL_1584614 (CHEMBL3820942)
IC50 0.900000±n/a nM
Citation Wang, PCFang, JMTsai, KCWang, SYHuang, WITseng, YCCheng, YSCheng, TJWong, CH Peramivir Phosphonate Derivatives as Influenza Neuraminidase Inhibitors. J Med Chem59:5297-310 (2016) 
 
Neuraminidase
Name:Neuraminidase
Type:PROTEIN
Mol. Mass.:49687.56
Organism:Influenza A virus
Description:ChEMBL_1347422
Residue:453
BDBM4994
NameBDBM4994
Synonyms:(3R,4R,5S)-5-amino-4-acetamido-3-(pentan-3-yloxy)cyclohex-1-ene-1-carboxylic acid GS4071 | Oseltamivir carboxylate
TypeSmall organic molecule
Emp. Form.C14H24N2O4
Mol. Mass.284.3514
SMILESCCC(CC)O[C@@H]1C=C(C[C@H](N)[C@H]1NC(C)=O)C(O)=O