Reaction Details
TargetSerine/threonine-protein kinase PAK 1
LigandBDBM50181451
Substrate/Competitorn/a
Meas. Tech.ChEBML_1584620
Ki 0.950000±n/a nM
Citation Rudolph, JMurray, LJNdubaku, COO'Brien, TBlackwood, EWang, WAliagas, IGazzard, LCrawford, JJDrobnick, JLee, WZhao, XHoeflich, KPFavor, DADong, PZhang, HHeise, CEOh, AOng, CCLa, HChakravarty, PChan, CJakubiak, DEpler, JRamaswamy, SVega, RCain, GDiaz, DZhong, Y Chemically Diverse Group I p21-Activated Kinase (PAK) Inhibitors Impart Acute Cardiovascular Toxicity with a Narrow Therapeutic Window. J Med Chem59:5520-41 (2016) 
 
Serine/threonine-protein kinase PAK 1
Name:Serine/threonine-protein kinase PAK 1
Type:n/a
Mol. Mass.:60640.15
Organism:Homo sapiens (Human)
Description:Q13153
Residue:545
BDBM50181451
NameBDBM50181451
Synonyms:CHEMBL3818265
TypeSmall organic molecule
Emp. Form.C26H26ClFN6O2
Mol. Mass.508.975
SMILESCNc1ncc2cc(-c3ccc(cc3Cl)-n3cccc(C)c3=O)c(=O)n(CCC3(F)CN(C)C3)c2n1