Reaction Details
TargetSerine/threonine-protein kinase PAK 1
LigandBDBM50182405
Substrate/Competitorn/a
Meas. Tech.ChEBML_1584620
Ki 5.9±n/a nM
Citation Rudolph, JMurray, LJNdubaku, COO'Brien, TBlackwood, EWang, WAliagas, IGazzard, LCrawford, JJDrobnick, JLee, WZhao, XHoeflich, KPFavor, DADong, PZhang, HHeise, CEOh, AOng, CCLa, HChakravarty, PChan, CJakubiak, DEpler, JRamaswamy, SVega, RCain, GDiaz, DZhong, Y Chemically Diverse Group I p21-Activated Kinase (PAK) Inhibitors Impart Acute Cardiovascular Toxicity with a Narrow Therapeutic Window. J Med Chem59:5520-41 (2016) 
 
Serine/threonine-protein kinase PAK 1
Name:Serine/threonine-protein kinase PAK 1
Type:n/a
Mol. Mass.:60640.15
Organism:Homo sapiens (Human)
Description:Q13153
Residue:545
BDBM50182405
NameBDBM50182405
Synonyms:CHEMBL3818016
TypeSmall organic molecule
Emp. Form.C25H24ClN5O4
Mol. Mass.493.942
SMILESCOCCn1c2nc(NC3COC3)ncc2cc(-c2ccc(cc2Cl)-n2cccc(C)c2=O)c1=O