Reaction Details
TargetSerine/threonine-protein kinase PAK 1
LigandBDBM50148921
Substrate/Competitorn/a
Meas. Tech.ChEMBL_1584620 (CHEMBL3820948)
Ki 3.7±n/a nM
Citation Rudolph, JMurray, LJNdubaku, COO'Brien, TBlackwood, EWang, WAliagas, IGazzard, LCrawford, JJDrobnick, JLee, WZhao, XHoeflich, KPFavor, DADong, PZhang, HHeise, CEOh, AOng, CCLa, HChakravarty, PChan, CJakubiak, DEpler, JRamaswamy, SVega, RCain, GDiaz, DZhong, Y Chemically Diverse Group I p21-Activated Kinase (PAK) Inhibitors Impart Acute Cardiovascular Toxicity with a Narrow Therapeutic Window. J Med Chem59:5520-41 (2016) 
 
Serine/threonine-protein kinase PAK 1
Name:Serine/threonine-protein kinase PAK 1
Type:n/a
Mol. Mass.:60640.15
Organism:Homo sapiens (Human)
Description:Q13153
Residue:545
BDBM50148921
NameBDBM50148921
Synonyms:CHEMBL3770443
TypeSmall organic molecule
Emp. Form.C25H25ClN6O3
Mol. Mass.492.957
SMILESCNc1ncc2cc(-c3ccc(cc3Cl)-c3cccc(C)n3)c(=O)n(C[C@H]3OC[C@H](N)CO3)c2n1