Reaction Details
TargetSerine/threonine-protein kinase PAK 1
LigandBDBM50182295
Substrate/Competitorn/a
Meas. Tech.ChEMBL_1584620 (CHEMBL3820948)
Ki 3.3±n/a nM
Citation Rudolph, JMurray, LJNdubaku, COO'Brien, TBlackwood, EWang, WAliagas, IGazzard, LCrawford, JJDrobnick, JLee, WZhao, XHoeflich, KPFavor, DADong, PZhang, HHeise, CEOh, AOng, CCLa, HChakravarty, PChan, CJakubiak, DEpler, JRamaswamy, SVega, RCain, GDiaz, DZhong, Y Chemically Diverse Group I p21-Activated Kinase (PAK) Inhibitors Impart Acute Cardiovascular Toxicity with a Narrow Therapeutic Window. J Med Chem59:5520-41 (2016) 
 
Serine/threonine-protein kinase PAK 1
Name:Serine/threonine-protein kinase PAK 1
Type:n/a
Mol. Mass.:60640.15
Organism:Homo sapiens (Human)
Description:Q13153
Residue:545
BDBM50182295
NameBDBM50182295
Synonyms:CHEMBL3818046
TypeSmall organic molecule
Emp. Form.C23H23ClN6O
Mol. Mass.434.921
SMILESCNc1ncc2cc(-c3ccc(cc3Cl)-c3cccc(C)n3)c(=O)n(CCCN)c2n1