Reaction Details
TargetNeuraminidase
LigandBDBM4706
Substrate/Competitorn/a
Meas. Tech.ChEMBL_1585714 (CHEMBL3821011)
IC50 1000±n/a nM
Citation Sriwilaijaroen, NMagesh, SImamura, AAndo, HIshida, HSakai, MIshitsubo, EHori, TMoriya, SIshikawa, TKuwata, KOdagiri, TTashiro, MHiramatsu, HTsukamoto, KMiyagi, TTokiwa, HKiso, MSuzuki, Y A Novel Potent and Highly Specific Inhibitor against Influenza Viral N1-N9 Neuraminidases: Insight into Neuraminidase-Inhibitor Interactions. J Med Chem59:4563-77 (2016) 
 
Neuraminidase
Name:Neuraminidase
Type:PROTEIN
Mol. Mass.:49687.56
Organism:Influenza A virus
Description:ChEMBL_1347422
Residue:453
BDBM4706
NameBDBM4706
Synonyms:(2R,3R,4S)-3-acetamido-4-hydroxy-2-[(1R,2R)-1,2,3-trihydroxypropyl]-3,4-dihydro-2H-pyran-6-carboxylic acid CHEMBL96712 Neu5Ac2en
TypeSmall organic molecule
Emp. Form.C11H17NO8
Mol. Mass.291.2546
SMILESCC(=O)N[C@@H]1[C@@H](O)C=C(O[C@H]1[C@H](O)[C@H](O)CO)C(O)=O