Reaction Details
TargetCytochrome P450 1A2
LigandBDBM50182250
Substrate/Competitorn/a
Meas. Tech.ChEMBL_1585817 (CHEMBL3821614)
IC50<10000±n/a nM
Citation Xu, HLu, HXu, ZLuan, LLi, CXu, YDong, KZhang, JLi, XLi, YLiu, GGong, SZhao, YGLiu, AZhang, YZhang, WCai, XXiang, JNElliott, JDLin, X Discovery of CNS Penetrant CXCR2 Antagonists for the Potential Treatment of CNS Demyelinating Disorders. ACS Med Chem Lett7:397-402 (2016) 
 
Cytochrome P450 1A2
Name:Cytochrome P450 1A2
Type:Enzyme
Mol. Mass.:58423.38
Organism:Homo sapiens (Human)
Description:P05177
Residue:516
BDBM50182250
NameBDBM50182250
Synonyms:CHEMBL3819521
TypeSmall organic molecule
Emp. Form.C19H20Cl3N3O4S
Mol. Mass.492.804
SMILESCN1CCC(CC1)S(=O)(=O)c1c(Cl)ccc(NC(=O)Nc2cccc(Cl)c2Cl)c1O