Reaction Details
TargetCytochrome P450 2D6
LigandBDBM50182252
Substrate/Competitorn/a
Meas. Tech.ChEMBL_1585818 (CHEMBL3821615)
IC50<10000±n/a nM
Citation Xu, HLu, HXu, ZLuan, LLi, CXu, YDong, KZhang, JLi, XLi, YLiu, GGong, SZhao, YGLiu, AZhang, YZhang, WCai, XXiang, JNElliott, JDLin, X Discovery of CNS Penetrant CXCR2 Antagonists for the Potential Treatment of CNS Demyelinating Disorders. ACS Med Chem Lett7:397-402 (2016) 
 
Cytochrome P450 2D6
Name:Cytochrome P450 2D6
Type:Protein
Mol. Mass.:55774.82
Organism:Homo sapiens (Human)
Description:P10635
Residue:497
BDBM50182252
NameBDBM50182252
Synonyms:CHEMBL3818331
TypeSmall organic molecule
Emp. Form.C20H22Cl2FN3O4S
Mol. Mass.490.376
SMILESCCN1CCC(CC1)S(=O)(=O)c1c(Cl)ccc(NC(=O)Nc2cccc(F)c2Cl)c1O