Reaction Details
TargetC-X-C chemokine receptor type 2
LigandBDBM50182263
Substrate/Competitorn/a
Meas. Tech.ChEMBL_1585799 (CHEMBL3821596)
IC50 0.501187±n/a nM
Citation Xu, HLu, HXu, ZLuan, LLi, CXu, YDong, KZhang, JLi, XLi, YLiu, GGong, SZhao, YGLiu, AZhang, YZhang, WCai, XXiang, JNElliott, JDLin, X Discovery of CNS Penetrant CXCR2 Antagonists for the Potential Treatment of CNS Demyelinating Disorders. ACS Med Chem Lett7:397-402 (2016) 
 
C-X-C chemokine receptor type 2
Name:C-X-C chemokine receptor type 2
Type:Protein
Mol. Mass.:40767.88
Organism:Homo sapiens (Human)
Description:P25025
Residue:360
BDBM50182263
NameBDBM50182263
Synonyms:CHEMBL3817901
TypeSmall organic molecule
Emp. Form.C16H15Cl2FN2O4S
Mol. Mass.421.271
SMILESCC(C)S(=O)(=O)c1c(Cl)ccc(NC(=O)Nc2cccc(F)c2Cl)c1O