Reaction Details
TargetCytochrome P450 2C9
LigandBDBM50182251
Substrate/Competitorn/a
Meas. Tech.ChEMBL_1585819 (CHEMBL3821616)
IC50<10000±n/a nM
Citation Xu, HLu, HXu, ZLuan, LLi, CXu, YDong, KZhang, JLi, XLi, YLiu, GGong, SZhao, YGLiu, AZhang, YZhang, WCai, XXiang, JNElliott, JDLin, X Discovery of CNS Penetrant CXCR2 Antagonists for the Potential Treatment of CNS Demyelinating Disorders. ACS Med Chem Lett7:397-402 (2016) 
 
Cytochrome P450 2C9
Name:Cytochrome P450 2C9
Type:Enzyme
Mol. Mass.:55636.33
Organism:Homo sapiens (Human)
Description:P11712
Residue:490
BDBM50182251
NameBDBM50182251
Synonyms:CHEMBL3819512
TypeSmall organic molecule
Emp. Form.C19H20Cl2FN3O4S
Mol. Mass.476.349
SMILESCN1CCC(CC1)S(=O)(=O)c1c(Cl)ccc(NC(=O)Nc2cccc(F)c2Cl)c1O