Reaction Details
TargetPotassium voltage-gated channel subfamily H member 2
LigandBDBM50182252
Substrate/Competitorn/a
Meas. Tech.ChEMBL_1585823 (CHEMBL3821620)
IC50<100000±n/a nM
Citation Xu, HLu, HXu, ZLuan, LLi, CXu, YDong, KZhang, JLi, XLi, YLiu, GGong, SZhao, YGLiu, AZhang, YZhang, WCai, XXiang, JNElliott, JDLin, X Discovery of CNS Penetrant CXCR2 Antagonists for the Potential Treatment of CNS Demyelinating Disorders. ACS Med Chem Lett7:397-402 (2016) 
 
Potassium voltage-gated channel subfamily H member 2
Name:Potassium voltage-gated channel subfamily H member 2
Type:Multi-pass membrane protein
Mol. Mass.:126672.65
Organism:Homo sapiens (Human)
Description:Q12809
Residue:1159
BDBM50182252
NameBDBM50182252
Synonyms:CHEMBL3818331
TypeSmall organic molecule
Emp. Form.C20H22Cl2FN3O4S
Mol. Mass.490.376
SMILESCCN1CCC(CC1)S(=O)(=O)c1c(Cl)ccc(NC(=O)Nc2cccc(F)c2Cl)c1O