Reaction Details
TargetC-X-C chemokine receptor type 2
LigandBDBM50182274
Substrate/Competitorn/a
Meas. Tech.ChEMBL_1585800 (CHEMBL3821597)
IC50 631±n/a nM
Citation Xu, HLu, HXu, ZLuan, LLi, CXu, YDong, KZhang, JLi, XLi, YLiu, GGong, SZhao, YGLiu, AZhang, YZhang, WCai, XXiang, JNElliott, JDLin, X Discovery of CNS Penetrant CXCR2 Antagonists for the Potential Treatment of CNS Demyelinating Disorders. ACS Med Chem Lett7:397-402 (2016) 
 
C-X-C chemokine receptor type 2
Name:C-X-C chemokine receptor type 2
Type:Protein
Mol. Mass.:40767.88
Organism:Homo sapiens (Human)
Description:P25025
Residue:360
BDBM50182274
NameBDBM50182274
Synonyms:CHEMBL3819163
TypeSmall organic molecule
Emp. Form.C20H20Cl2FN3O4S
Mol. Mass.488.36
SMILESCN1CC2(CC(C2)S(=O)(=O)c2c(Cl)ccc(NC(=O)Nc3cccc(F)c3Cl)c2O)C1