Reaction Details
TargetFibroblast growth factor 2
LigandBDBM50182286
Substrate/Competitorn/a
Meas. Tech.ChEMBL_1584167 (CHEMBL3821485)
IC50 10000±n/a nM
Citation Castelli, RGiacomini, AAnselmi, MBozza, NVacondio, FRivara, SMatarazzo, SPresta, MMor, MRonca, R Synthesis, Structural Elucidation, and Biological Evaluation of NSC12, an Orally Available Fibroblast Growth Factor (FGF) Ligand Trap for the Treatment of FGF-Dependent Lung Tumors. J Med Chem59:4651-63 (2016) 
 
Fibroblast growth factor 2
Name:Fibroblast growth factor 2
Type:Protein
Mol. Mass.:30803.89
Organism:Homo sapiens (Human)
Description:P09038
Residue:288
BDBM50182286
NameBDBM50182286
Synonyms:CHEMBL3819333
TypeSmall organic molecule
Emp. Form.C24H34F6O3
Mol. Mass.484.5154
SMILES[H][C@@]1(CC[C@@]2([H])[C@]3([H])CC=C4C[C@@H](O)CC[C@]4(C)[C@@]3([H])CC[C@]12C)C(O)CC(O)(C(F)(F)F)C(F)(F)F